{"text_format":"1","workbook":"xlsx","n_sheets":3,"sheets":["Groep A","Groep B","Blad1"],"not_rendered":{"charts":0,"images":0,"macros":1,"external_links":0,"defined_names":2,"comments":0,"pivot_tables":0},"unopened":[],"bounds":{"document_bytes":16777216,"sheet_cells":100000,"rows_first":2000,"rows_last":500,"rows_between":2000,"halvings":0,"cell_chars":16384,"cell_head_chars":4096},"cells_cut":0,"cells_raw":0,"read":"whole","date_system":"1900"}

{"sheet":"Groep A","index":0,"n_rows":90,"n_cols":25,"rows_kept":90,"cut":false,"hidden":false,"merged":[]}
[null,"Datum","GROEP A",null,"Moyenne","te maken caramboles","rating getal","caramboles 1e partij","hoogdte serie 1e partij","percentage 1e partij","caramboles 2e partij","hoogste serie 2e partij","percentage 2e partij","totaal caramboles","gespeeld gemiddelde","gespeeld percentage","Punten afgerond ","uitgenodigd Finale"]
[1,"2021-11-30","Roelie Doornbos","A",{"$f":"VLOOKUP(F2,X$2:Y29,2)","v":1.65},42,{"$f":"F2/25","v":1.68},74,12,{"$f":"H2/F2*100","v":176.19047619047618},40,4,{"$f":"K2/F2*100","v":95.238095238095227},{"$f":"H2+K2","v":114},{"$f":"N2/50","v":2.2799999999999998},{"$f":"O2/G2*100","v":135.71428571428569},{"$f":"ROUNDDOWN(P2,0)","v":135},null,null,null,null,null,null,12,0.27]
[2,"2021-11-30","Ton Been","A",{"$f":"VLOOKUP(F3,X$2:Y30,2)","v":2.37},56,2.2400000000000002,81,17,144.64285714285714,55,7,98.214285714285708,136,2.72,121.42857142857142,121,null,null,null,null,null,null,14,0.32]
[3,"2021-12-01","Willie Siemens","A",{"$f":"VLOOKUP(F4,X$2:Y31,2)","v":2.62},60,2.4,77,12,128.33333333333334,64,15,106.66666666666667,141,2.82,117.5,117,null,null,null,null,null,null,15,0.37]
[4,"2021-12-04","Geiko Reder","A",{"$f":"VLOOKUP(F5,X$2:Y32,2)","v":1.65},42,1.68,49,8,116.66666666666667,49,8,116.66666666666667,98,1.96,116.66666666666667,116,null,null,null,null,null,null,17,0.42]
[5,null,"Henk Mathijssen","A",{"$f":"VLOOKUP(F6,X$2:Y33,2)","v":2.62},60,2.4,87,13,145,52,9,86.666666666666671,139,2.78,115.83333333333331,115,null,null,null,null,null,null,18,0.47]
[6,"2021-12-04","Jan Sietsma","A",{"$f":"VLOOKUP(F7,X$2:Y34,2)","v":2.87},64,2.56,90,25,140.625,56,12,87.5,146,2.92,114.0625,114,null,null,null,null,null,null,20,0.55000000000000004]
[7,"2021-11-27","Richart Kant","A",{"$f":"VLOOKUP(F8,X$2:Y35,2)","v":3.12},68,2.72,87,13,127.94117647058823,67,13,98.529411764705884,154,3.08,113.23529411764706,113,null,null,null,null,null,null,22,0.65]
[8,"2021-12-04","Ronnie Berg","A",{"$f":"VLOOKUP(F9,X$2:Y36,2)","v":1.85},47,1.88,58,12,123.40425531914893,44,8,93.61702127659575,102,2.04,108.51063829787235,108,null,null,null,null,null,null,23,0.75]
[9,"2021-12-01","Ron Eissen","A",{"$f":"VLOOKUP(F10,X$2:Y37,2)","v":1.75},45,1.8,29,4,64.444444444444443,67,12,148.88888888888889,96,1.92,106.66666666666667,106,null,null,null,null,null,null,25,0.85]
[10,"2021-11-30","Jan Poot","A",{"$f":"VLOOKUP(F11,X$2:Y38,2)","v":1.85},47,1.88,56,8,119.14893617021276,43,10,91.489361702127653,99,1.98,105.31914893617022,105,null,null,null,null,null,null,26,0.95]
[11,"2021-11-30","Siep Ziesling","A",{"$f":"VLOOKUP(F12,X$2:Y39,2)","v":1.65},42,1.68,54,12,128.57142857142858,33,9,78.571428571428569,87,1.74,103.57142857142858,103,null,null,null,null,null,null,28,1.05]
[12,"2021-12-01","Tjaad Schaub","A",{"$f":"VLOOKUP(F13,X$2:Y40,2)","v":3.12},68,2.72,47,6,69.117647058823522,93,9,136.76470588235296,140,2.8,102.94117647058823,102,null,null,null,null,null,null,30,1.1499999999999999]
[13,"2021-11-27","Henk Bos","A",{"$f":"VLOOKUP(F14,X$2:Y41,2)","v":2.87},64,2.56,58,9,90.625,70,12,109.375,128,2.56,100,100,null,null,null,null,null,null,33,1.25]
[14,"2021-11-30","Kasper Sturre","A",{"$f":"VLOOKUP(F15,X$2:Y42,2)","v":2.62},60,2.4,67,8,111.66666666666667,53,9,88.333333333333329,120,2.4,100,100,null,null,null,null,null,null,35,1.35]
[15,"2021-12-01","Eiso Kleefman","A",{"$f":"VLOOKUP(F16,X$2:Y43,2)","v":2.37},56,2.2400000000000002,59,12,105.35714285714286,53,11,94.642857142857139,112,2.2400000000000002,100,100,null,null,null,null,null,null,38,1.45]
[16,"2021-11-30","MarinusTapilatu","A",{"$f":"VLOOKUP(F17,X$2:Y44,2)","v":1.85},47,1.88,45,9,95.744680851063833,46,7,97.872340425531917,91,1.82,96.808510638297889,96,null,null,null,null,null,null,40,1.55]
[17,"2021-11-30","Geert Greving","A",{"$f":"VLOOKUP(F18,X$2:Y45,2)","v":3.37},72,2.88,68,20,94.444444444444443,70,10,97.222222222222214,138,2.76,95.833333333333329,95,null,null,null,null,null,null,42,1.65]
[18,"2021-12-01","Anton Senneker","A",{"$f":"VLOOKUP(F19,X$2:Y46,2)","v":1.85},47,1.88,36,5,76.59574468085107,53,8,112.7659574468085,89,1.78,94.680851063829792,94,null,null,null,null,null,null,45,1.75]
[19,"2021-12-02","Eefke Robs","A",{"$f":"VLOOKUP(F20,X$2:Y47,2)","v":1.85},47,1.88,38,9,80.851063829787222,50,7,106.38297872340425,88,1.76,93.61702127659575,93,null,null,null,null,null,null,47,1.85]
[20,"2021-12-01","Klaas Boven","A",{"$f":"VLOOKUP(F21,X$2:Y48,2)","v":1.65},42,1.68,41,7,97.61904761904762,37,10,88.095238095238088,78,1.56,92.857142857142861,92,null,null,null,null,null,null,50,1.95]
[21,"2021-12-04","Bernard Bos","A",{"$f":"VLOOKUP(F22,X$2:Y49,2)","v":1.75},45,1.8,37,4,82.222222222222214,46,6,102.22222222222221,83,1.66,92.222222222222214,92,null,null,null,null,null,null,52,2.12]
[22,"2021-12-02","Jan Olsder","A",{"$f":"VLOOKUP(F23,X$2:Y50,2)","v":1.95},50,2,40,4,80,50,7,100,90,1.8,90,90,null,null,null,null,null,null,56,2.37]
[23,"2021-11-30","Piet Bouwman","A",{"$f":"VLOOKUP(F24,X$2:Y51,2)","v":2.37},56,2.2400000000000002,59,8,105.35714285714286,37,8,66.071428571428569,96,1.92,85.714285714285694,85,null,null,null,null,null,null,60,2.62]
[24,"2021-12-04","Lucas Bronsema","A",{"$f":"VLOOKUP(F25,X$2:Y52,2)","v":3.12},68,2.72,66,18,97.058823529411768,50,29,73.529411764705884,116,2.3199999999999998,85.294117647058812,85,null,null,null,null,null,null,64,2.87]
[25,"2021-11-30","Willem Reilink","A",{"$f":"VLOOKUP(F26,X$2:Y53,2)","v":3.12},68,2.72,54,8,79.411764705882348,60,14,88.235294117647058,114,2.2799999999999998,83.823529411764696,83,null,null,null,null,null,null,68,3.12]
[26,"2021-11-30","Stinus Sluiter","A",{"$f":"VLOOKUP(F27,X$2:Y54,2)","v":3.75},80,3.2,57,18,71.25,76,11,95,133,2.66,83.125,83,null,null,null,null,null,null,72,3.37]
[27,"2021-11-30","Wolter Eling","A",{"$f":"VLOOKUP(F28,X$2:Y55,2)","v":3.37},72,2.88,67,12,93.055555555555557,51,8,70.833333333333343,118,2.36,81.944444444444443,81,null,null,null,null,null,null,80,3.75]
[28,"2021-11-30","Pieter Huizeling","A",{"$f":"VLOOKUP(F29,X$2:Y56,2)","v":1.95},50,2,29,4,57.999999999999993,46,10,92,75,1.5,75,75,null,null,null,null,null,null,88,4.25]
[29,"2021-11-27","Cees Doornbos","A",{"$f":"VLOOKUP(F30,X$2:Y57,2)","v":2.37},56,2.2400000000000002,39,6,69.642857142857139,43,7,76.785714285714292,82,1.64,73.214285714285694,73,null,null,null,null,null,null,96,4.75]
[30,"2021-12-04","Roelof Eefting","A",{"$f":"VLOOKUP(F31,X$2:Y58,2)","v":3.37},72,2.88,47,9,65.277777777777786,57,7,79.166666666666657,104,2.08,72.222222222222229,72,null,null,null,null,null,null,104,5.25]
[31,"2021-11-27","Jos Bouwmeester","A",{"$f":"VLOOKUP(F32,X$2:Y59,2)","v":1.95},50,2,40,9,80,32,9,64,72,1.44,72,72,null,null,null,null,null,null,112,5.75]
[32,"2021-11-25","Siep Mellema","A",{"$f":"VLOOKUP(F33,X$2:Y60,2)","v":2.37},58,2.3199999999999998,42,9,72.41379310344827,38,9,65.517241379310349,80,1.6,68.965517241379317,68]
[33,"2021-11-30","Piet van Oosten","A",{"$f":"VLOOKUP(F34,X$2:Y61,2)","v":1.55},40,{"$f":"F34/25","v":1.6},26,6,{"$f":"H34/F34*100","v":65},28,4,{"$f":"K34/F34*100","v":70},{"$f":"H34+K34","v":54},{"$f":"N34/50","v":1.08},{"$f":"O34/G34*100","v":67.5},{"$f":"ROUNDDOWN(P34,0)","v":67}]
[34,"2021-12-04","Derk Jan v/d Laan","A",{"$f":"VLOOKUP(F35,X$2:Y62,2)","v":2.37},56,2.2400000000000002,33,5,58.928571428571431,29,5,51.785714285714292,62,1.24,55.357142857142847,55]
[35,"2021-12-04","Eppo Loer","A",{"$f":"VLOOKUP(F36,X$2:Y63,2)","v":2.12},52,2.08,null,null,0,null,null,0,0,0,0,0]
[36,"2021-12-04","Jan Boltjes","A",{"$f":"VLOOKUP(F37,X$2:Y64,2)","v":1.65},42,1.68,null,null,0,null,null,0,0,0,0,0]
[37,null,null,"A",{"$f":"VLOOKUP(F38,X$2:Y65,2)","v":1.95},50,2,null,null,0,null,null,0,0,0,0,0]
[38,null,null,"A",{"$f":"VLOOKUP(F39,X$2:Y66,2)","v":3.12},68,2.72,null,null,0,null,null,0,0,0,0,0]
[39,null,null,"A",{"$f":"VLOOKUP(F40,X$2:Y67,2)","v":1.95},50,2,null,null,0,null,null,0,0,0,0,0]
[40,null,null,"A",{"$f":"VLOOKUP(F41,X$2:Y68,2)","v":2.37},56,2.2400000000000002,null,null,0,null,null,0,0,0,0,0]
[41,null,null,"A",{"$f":"VLOOKUP(F42,X$2:Y69,2)","v":1.75},45,1.8,null,null,0,null,null,0,0,0,0,0]
[42,null,null,"A",{"$f":"VLOOKUP(F43,X$2:Y70,2)","v":2.62},60,2.4,null,null,0,null,null,0,0,0,0,0]
[43,null,null,"A",{"$f":"VLOOKUP(F44,X$2:Y71,2)","v":2.87},64,2.56,null,null,0,null,null,0,0,0,0,0]
[44,null,null,"A",{"$f":"VLOOKUP(F45,X$2:Y72,2)","v":1.85},47,1.88,null,null,0,null,null,0,0,0,0,0]
[45,null,null,"A",{"$f":"VLOOKUP(F46,X$2:Y73,2)","v":4.25},88,3.52,null,null,0,null,null,0,0,0,0,0]
[46,null,null,"A",{"$f":"VLOOKUP(F47,X$2:Y74,2)","v":1.05},28,1.1200000000000001,null,null,0,null,null,0,0,0,0,0]
[47,null,null,"A",{"$f":"VLOOKUP(F48,X$2:Y75,2)","v":0.32},14,0.56000000000000005,null,null,0,null,null,0,0,0,0,0]
[48,null,null,"A",{"$f":"VLOOKUP(F49,X$2:Y76,2)","v":0.32},14,0.56000000000000005,null,null,0,null,null,0,0,0,0,0]
[49,null,null,"A",{"$f":"VLOOKUP(F50,X$2:Y77,2)","v":0.32},14,0.56000000000000005,null,null,0,null,null,0,0,0,0,0]
[50,null,null,"A",{"$f":"VLOOKUP(F51,X$2:Y78,2)","v":0.32},14,0.56000000000000005,null,null,0,null,null,0,0,0,0,0]
[51,null,null,"A",{"$f":"VLOOKUP(F52,X$2:Y79,2)","v":4.25},88,3.52,null,null,0,null,null,0,0,0,0,0]
[52,null,null,"A",{"$f":"VLOOKUP(F53,X$2:Y80,2)","v":0.32},14,0.56000000000000005,null,null,0,null,null,0,0,0,0,0]
[53,null,null,"A",{"$f":"VLOOKUP(F54,X$2:Y81,2)","v":0.32},14,0.56000000000000005,null,null,0,null,null,0,0,0,0,0]
[54,null,null,"A",{"$f":"VLOOKUP(F55,X$2:Y82,2)","v":0.32},14,0.56000000000000005,null,null,0,null,null,0,0,0,0,0]
[55,null,null,"A",{"$f":"VLOOKUP(F56,X$2:Y83,2)","v":0.32},14,0.56000000000000005,null,null,0,null,null,0,0,0,0,0]
[56,null,null,"A",{"$f":"VLOOKUP(F57,X$2:Y84,2)","v":0.32},14,0.56000000000000005,null,null,0,null,null,0,0,0,0,0]
[57,null,null,"A",{"$f":"VLOOKUP(F58,X$2:Y85,2)","v":0.32},14,0.56000000000000005,null,null,0,null,null,0,0,0,0,0]
[58,null,null,"A",{"$f":"VLOOKUP(F59,X$2:Y86,2)","v":0.32},14,0.56000000000000005,null,null,0,null,null,0,0,0,0,0]
[59,null,null,"A",{"$f":"VLOOKUP(F60,X$2:Y87,2)","v":0.32},14,0.56000000000000005,null,null,0,null,null,0,0,0,0,0]
[60,null,null,"A",{"$f":"VLOOKUP(F61,X$2:Y88,2)","v":0.32},14,0.56000000000000005,null,null,0,null,null,0,0,0,0,0]
[61,null,null,"A",{"$f":"VLOOKUP(F62,X$2:Y89,2)","v":0.32},14,0.56000000000000005,null,null,0,null,null,0,0,0,0,0]
[62,null,null,"A",{"$f":"VLOOKUP(F63,X$2:Y90,2)","v":0.32},14,0.56000000000000005,null,null,0,null,null,0,0,0,0,0]
[63,null,null,"A",{"$f":"VLOOKUP(F64,X$2:Y91,2)","v":0.32},14,0.56000000000000005,null,null,0,null,null,0,0,0,0,0]
[64,null,null,"A",{"$f":"VLOOKUP(F65,X$2:Y92,2)","v":0.32},14,0.56000000000000005,null,null,0,null,null,0,0,0,0,0]
[65,null,null,"A",{"$f":"VLOOKUP(F66,X$2:Y93,2)","v":0.32},14,{"$f":"F66/25","v":0.56000000000000005},null,null,{"$f":"H66/F66*100","v":0},null,null,{"$f":"K66/F66*100","v":0},{"$f":"H66+K66","v":0},{"$f":"N66/50","v":0},{"$f":"O66/G66*100","v":0},{"$f":"ROUNDDOWN(P66,0)","v":0}]
[66,null,null,"A",{"$f":"VLOOKUP(F67,X$2:Y94,2)","v":0.32},14,0.56000000000000005,null,null,0,null,null,0,0,0,0,0]
[67,null,null,"A",{"$f":"VLOOKUP(F68,X$2:Y95,2)","v":0.32},14,0.56000000000000005,null,null,0,null,null,0,0,0,0,0]
[68,null,null,"A",{"$f":"VLOOKUP(F69,X$2:Y96,2)","v":0.32},14,0.56000000000000005,null,null,0,null,null,0,0,0,0,0]
[69,null,null,"A",{"$f":"VLOOKUP(F70,X$2:Y97,2)","v":0.32},14,0.56000000000000005,null,null,0,null,null,0,0,0,0,0]
[70,null,null,"A",{"$f":"VLOOKUP(F71,X$2:Y98,2)","v":0.32},14,0.56000000000000005,null,null,0,null,null,0,0,0,0,0]
[71,null,null,"A",{"$f":"VLOOKUP(F72,X$2:Y99,2)","v":0.32},14,0.56000000000000005,null,null,0,null,null,0,0,0,0,0]
[72,null,null,"A",{"$f":"VLOOKUP(F73,X$2:Y100,2)","v":0.32},14,0.56000000000000005,null,null,0,null,null,0,0,0,0,0]
[73,null,null,"A",{"$f":"VLOOKUP(F74,X$2:Y101,2)","v":0.32},14,0.56000000000000005,null,null,0,null,null,0,0,0,0,0]
[74,null,null,"A",{"$f":"VLOOKUP(F75,X$2:Y102,2)","v":0.32},14,0.56000000000000005,null,null,0,null,null,0,0,0,0,0]
[75,null,null,"A",{"$f":"VLOOKUP(F76,X$2:Y103,2)","v":0.32},14,0.56000000000000005,null,null,0,null,null,0,0,0,0,0]
[76,null,null,"A",{"$f":"VLOOKUP(F77,X$2:Y104,2)","v":0.32},14,0.56000000000000005,null,null,0,null,null,0,0,0,0,0]
[77,null,null,"A",{"$f":"VLOOKUP(F78,X$2:Y105,2)","v":0.32},14,0.56000000000000005,null,null,0,null,null,0,0,0,0,0]
[78,null,null,"A",{"$f":"VLOOKUP(F79,X$2:Y106,2)","v":0.32},14,0.56000000000000005,null,null,0,null,null,0,0,0,0,0]
[79,null,null,"A",{"$f":"VLOOKUP(F80,X$2:Y107,2)","v":0.32},14,0.56000000000000005,null,null,0,null,null,0,0,0,0,0]
{"$rows_left_out":11}
{"sheet":"Groep B","index":1,"n_rows":90,"n_cols":18,"rows_kept":90,"cut":false,"hidden":false,"merged":[]}
[null,"Datum","GROEP B",null,"Moyenne","te maken caramboles","rating getal","caramboles 1e partij","hoogste serie 1e partij","percentage 1e partij","caramboles 2e partij","hoogste serie 2e partij","percentage 2e partij","totaal caramboles","gespeeld gemiddelde","gespeeld percentage","Punten afgerond ","uitgenodigd Finale"]
[1,"2021-12-01","Elzo Dijk","B",{"$f":"VLOOKUP(F2,'Groep A'!X$2:Y35,2)","v":1.05},28,{"$f":"F2/25","v":1.1200000000000001},50,8,{"$f":"H2/F2*100","v":178.57142857142858},31,6,{"$f":"K2/F2*100","v":110.71428571428572},{"$f":"H2+K2","v":81},{"$f":"N2/50","v":1.62},{"$f":"O2/G2*100","v":144.64285714285714},{"$f":"ROUNDDOWN(P2,0)","v":144}]
[2,"2021-12-01","Guide van Alfen","B",{"$f":"VLOOKUP(F3,'Groep A'!X$2:Y48,2)","v":1.45},38,1.52,66,10,173.68421052631581,39,9,102.63157894736842,105,2.1,138.15789473684211,138]
[3,"2021-12-01","Johan Boonma","B",{"$f":"VLOOKUP(F4,'Groep A'!X$2:Y33,2)","v":1.1499999999999999},30,1.2,37,7,123.33333333333334,45,9,150,82,1.64,136.66666666666666,136]
[4,"2021-11-30","Caren Eling","B",{"$f":"VLOOKUP(F5,'Groep A'!X$2:Y57,2)","v":0.55000000000000004},20,0.8,30,5,150,21,3,105,51,1.02,127.49999999999999,127]
[5,"2021-11-30","Klaas Boersma","B",{"$f":"VLOOKUP(F6,'Groep A'!X$2:Y54,2)","v":1.1499999999999999},30,1.2,41,7,136.66666666666666,33,6,110.00000000000001,74,1.48,123.33333333333334,123]
[6,"2021-11-30","Henk hofman","B",{"$f":"VLOOKUP(F7,'Groep A'!X$2:Y37,2)","v":1.75},45,1.8,58,4,128.88888888888889,53,11,117.77777777777779,111,2.2200000000000002,123.33333333333334,123]
[7,"2021-12-01","Henrie Leeuwerke","B",{"$f":"VLOOKUP(F8,'Groep A'!X$2:Y46,2)","v":0.47},18,0.72,27,10,150,16,4,88.888888888888886,43,0.86,119.44444444444444,119]
[8,"2021-12-01","Fred Maas","B",{"$f":"VLOOKUP(F9,'Groep A'!X$2:Y29,2)","v":0.75},23,0.92,22,4,95.652173913043484,32,4,139.13043478260869,54,1.08,117.39130434782609,117]
[9,"2021-11-25","Geert Jager","B",{"$f":"VLOOKUP(F10,'Groep A'!X$2:Y41,2)","v":0.55000000000000004},20,0.8,19,3,95,27,5,135,46,0.92,114.99999999999999,115]
[10,null,"Daniel Kerbof","B",{"$f":"VLOOKUP(F11,'Groep A'!X$2:Y60,2)","v":0.85},25,1,17,4,68,40,8,160,57,1.1399999999999999,113.99999999999999,114]
[11,"2021-11-30","Fred Stok","B",{"$f":"VLOOKUP(F12,'Groep A'!X$2:Y47,2)","v":1.1499999999999999},30,1.2,35,6,116.66666666666667,33,5,110.00000000000001,68,1.36,113.33333333333336,113]
[12,null,"Roy Kerbof","B",{"$f":"VLOOKUP(F13,'Groep A'!X$2:Y64,2)","v":1.45},38,1.52,46,6,121.05263157894737,39,6,102.63157894736842,85,1.7,111.8421052631579,111]
[13,"2021-11-27","Feike Moerman","B",{"$f":"VLOOKUP(F14,'Groep A'!X$2:Y43,2)","v":0.95},26,1.04,22,4,84.615384615384613,36,8,138.46153846153845,58,1.1599999999999999,111.53846153846152,111]
[14,"2021-11-30","Jan Bos","B",{"$f":"VLOOKUP(F15,'Groep A'!X$2:Y92,2)","v":0.55000000000000004},20,0.8,26,5,130,18,6,90,44,0.88,109.99999999999999,110]
[15,"2021-11-27","Frans de Groot","B",{"$f":"VLOOKUP(F16,'Groep A'!$X$2:$Y$32,2)","v":0.85},25,1,19,4,76,34,4,136,53,1.06,106,106]
[16,"2021-12-04","Patrick Smid","B",{"$f":"VLOOKUP(F17,'Groep A'!X$2:Y63,2)","v":1.05},28,1.1200000000000001,24,7,85.714285714285708,35,6,125,59,1.18,105.35714285714283,105]
[17,"2021-11-25","Elzo Lubbers","B",{"$f":"VLOOKUP(F18,'Groep A'!X$2:Y32,2)","v":1.45},38,1.52,29,4,76.31578947368422,50,7,131.57894736842107,79,1.58,103.94736842105263,103]
[18,"2021-12-01","Jan Weerts","B",{"$f":"VLOOKUP(F19,'Groep A'!X$2:Y55,2)","v":0.55000000000000004},20,0.8,17,4,85,24,5,120,41,0.82,102.49999999999999,102]
[19,"2021-12-04","Pieter van der Poel","B",{"$f":"VLOOKUP(F20,'Groep A'!X$2:Y49,2)","v":1.25},33,1.32,32,6,96.969696969696969,35,6,106.06060606060606,67,1.34,101.51515151515152,101]
[20,"2021-11-25","Bert Dallinga","B",{"$f":"VLOOKUP(F21,'Groep A'!X$2:Y90,2)","v":0.95},26,1.04,23,5,88.461538461538453,29,5,111.53846153846155,52,1.04,100,100]
[21,"2021-12-01","Tallie Siemens","B",{"$f":"VLOOKUP(F22,'Groep A'!X$2:Y45,2)","v":0.95},26,1.04,30,5,115.38461538461537,22,4,84.615384615384613,52,1.04,100,100]
[22,"2021-12-01","Jan Tepper","B",{"$f":"VLOOKUP(F23,'Groep A'!X$2:Y53,2)","v":1.25},33,1.32,32,5,96.969696969696969,27,4,81.818181818181827,59,1.18,89.393939393939377,89]
[23,"2021-11-30","Harrie Bos","B",{"$f":"VLOOKUP(F24,'Groep A'!X$2:Y39,2)","v":1.55},40,1.6,32,8,80,39,7,97.5,71,1.42,88.75,88]
[24,"2021-11-27","Wijnold Broekema","B",{"$f":"VLOOKUP(F25,'Groep A'!X$2:Y36,2)","v":1.25},33,1.32,24,5,72.727272727272734,33,5,100,57,1.1399999999999999,86.36363636363636,86]
[25,"2021-12-02","Jurrie Ekamper","B",{"$f":"VLOOKUP(F26,'Groep A'!X$2:Y52,2)","v":0.47},18,0.72,18,2,100,13,3,72.222222222222214,31,0.62,86.111111111111114,86]
[26,"2021-11-30","Derk Nieuwenhuis","B",{"$f":"VLOOKUP(F27,'Groep A'!X$2:Y30,2)","v":1.45},38,1.52,31,5,81.578947368421055,34,4,89.473684210526315,65,1.3,85.526315789473685,85]
[27,"2021-11-25","Hugo Jonker","B",{"$f":"VLOOKUP(F28,'Groep A'!X$2:Y40,2)","v":1.35},35,1.4,22,4,62.857142857142854,37,10,105.71428571428572,59,1.18,84.285714285714292,84]
[28,"2021-12-04","Reint Boltendal","B",{"$f":"VLOOKUP(F29,'Groep A'!X$2:Y98,2)","v":1.45},38,1.52,34,5,89.473684210526315,30,6,78.94736842105263,64,1.28,84.210526315789465,84]
[29,"2021-11-30","Folgert Kaman","B",{"$f":"VLOOKUP(F30,'Groep A'!X$2:Y51,2)","v":0.65},22,0.88,21,5,95.454545454545453,16,4,72.727272727272734,37,0.74,84.090909090909093,84]
[30,"2021-12-04","Cor Zeeman","B",{"$f":"VLOOKUP(F31,'Groep A'!X$2:Y50,2)","v":1.1499999999999999},30,1.2,29,4,96.666666666666671,21,5,70,50,1,83.333333333333343,83]
[31,"2021-11-25","Reint Loer","B",{"$f":"VLOOKUP(F32,'Groep A'!X$2:Y38,2)","v":1.25},33,1.32,14,3,42.424242424242422,40,6,121.21212121212122,54,1.08,81.818181818181827,81]
[32,"2021-12-01","Jan Post","B",{"$f":"VLOOKUP(F33,'Groep A'!X$2:Y117,2)","v":0.95},26,1.04,15,4,57.692307692307686,27,8,103.84615384615385,42,0.84,80.769230769230759,80]
[33,"2021-12-02","Jan Schikker","B",{"$f":"VLOOKUP(F34,'Groep A'!X$2:Y91,2)","v":1.05},28,{"$f":"F34/25","v":1.1200000000000001},15,4,{"$f":"H34/F34*100","v":53.571428571428569},27,4,{"$f":"K34/F34*100","v":96.428571428571431},{"$f":"H34+K34","v":42},{"$f":"N34/50","v":0.84},{"$f":"O34/G34*100","v":74.999999999999986},{"$f":"ROUNDDOWN(P34,0)","v":75}]
[34,"2021-12-02","Hindrik Schuur","B",{"$f":"VLOOKUP(F35,'Groep A'!X$2:Y44,2)","v":1.35},35,1.4,20,3,57.142857142857139,28,5,80,48,0.96,68.571428571428569,68]
[35,"2021-11-30","Eisse Bolt","B",{"$f":"VLOOKUP(F36,'Groep A'!X$2:Y56,2)","v":1.55},40,1.6,26,4,65,28,8,70,54,1.08,67.5,67]
[36,"2021-12-02","Piet Wust","B",{"$f":"VLOOKUP(F37,'Groep A'!X$2:Y42,2)","v":1.45},38,1.52,25,7,65.789473684210535,23,7,60.526315789473685,48,0.96,63.157894736842103,63]
[37,null,null,"B",{"$f":"VLOOKUP(F38,'Groep A'!X$2:Y61,2)","v":3.12},68,2.72,null,null,0,null,null,0,0,0,0,0]
[38,null,null,"B",{"$f":"VLOOKUP(F39,'Groep A'!X$2:Y58,2)","v":1.65},42,1.68,null,null,0,null,null,0,0,0,0,0]
[39,"2021-12-04","Ella Hilbolling","B",{"$f":"VLOOKUP(F40,'Groep A'!X$2:Y31,2)","v":0.65},22,0.88,null,null,0,null,null,0,0,0,0,0]
[40,"2021-12-04","Harm Wending","B",{"$f":"VLOOKUP(F41,'Groep A'!X$2:Y34,2)","v":1.65},42,1.68,null,null,0,null,null,0,0,0,0,0]
[41,null,null,"B",{"$f":"VLOOKUP(F42,'Groep A'!X$2:Y59,2)","v":0.65},22,0.88,null,null,0,null,null,0,0,0,0,0]
[42,null,null,"B",{"$f":"VLOOKUP(F43,'Groep A'!X$2:Y88,2)","v":1.55},40,1.6,null,null,0,null,null,0,0,0,0,0]
[43,null,null,"B",{"$f":"VLOOKUP(F44,'Groep A'!X$2:Y65,2)","v":1.65},42,1.68,null,null,0,null,null,0,0,0,0,0]
[44,null,null,"B",{"$f":"VLOOKUP(F45,'Groep A'!X$2:Y89,2)","v":0.85},25,1,null,null,0,null,null,0,0,0,0,0]
[45,null,null,"B",{"$f":"VLOOKUP(F46,'Groep A'!X$2:Y66,2)","v":1.25},33,1.32,null,null,0,null,null,0,0,0,0,0]
[46,null,null,"B",{"$f":"VLOOKUP(F47,'Groep A'!X$2:Y67,2)","v":1.25},33,1.32,null,null,0,null,null,0,0,0,0,0]
[47,null,null,"B",{"$f":"VLOOKUP(F48,'Groep A'!X$2:Y77,2)","v":1.55},40,1.6,null,null,0,null,null,0,0,0,0,0]
[48,null,null,"B",{"$f":"VLOOKUP(F49,'Groep A'!X$2:Y80,2)","v":1.55},40,1.6,null,null,0,null,null,0,0,0,0,0]
[49,null,null,"B",{"$f":"VLOOKUP(F50,'Groep A'!X$2:Y68,2)","v":1.25},33,1.32,null,null,0,null,null,0,0,0,0,0]
[50,null,null,"B",{"$f":"VLOOKUP(F51,'Groep A'!X$2:Y69,2)","v":1.45},38,1.52,null,null,0,null,null,0,0,0,0,0]
[51,null,null,"B",{"$f":"VLOOKUP(F52,'Groep A'!X$2:Y70,2)","v":0.95},26,1.04,null,null,0,null,null,0,0,0,0,0]
[52,null,null,"B",{"$f":"VLOOKUP(F53,'Groep A'!X$2:Y71,2)","v":1.1499999999999999},30,1.2,null,null,0,null,null,0,0,0,0,0]
[53,null,null,"B",{"$f":"VLOOKUP(F54,'Groep A'!X$2:Y72,2)","v":1.25},33,1.32,null,null,0,null,null,0,0,0,0,0]
[54,null,null,"B",{"$f":"VLOOKUP(F55,'Groep A'!X$2:Y73,2)","v":1.25},33,1.32,null,null,0,null,null,0,0,0,0,0]
[55,null,null,"B",{"$f":"VLOOKUP(F56,'Groep A'!X$2:Y74,2)","v":1.05},28,1.1200000000000001,null,null,0,null,null,0,0,0,0,0]
[56,null,null,"B",{"$f":"VLOOKUP(F57,'Groep A'!X$2:Y75,2)","v":0.95},26,1.04,null,null,0,null,null,0,0,0,0,0]
[57,null,null,"B",{"$f":"VLOOKUP(F58,'Groep A'!X$2:Y76,2)","v":1.35},35,1.4,null,null,0,null,null,0,0,0,0,0]
[58,null,null,"B",{"$f":"VLOOKUP(F59,'Groep A'!X$2:Y62,2)","v":1.05},28,1.1200000000000001,null,null,0,null,null,0,0,0,0,0]
[59,null,null,"B",{"$f":"VLOOKUP(F60,'Groep A'!X$2:Y115,2)","v":1.35},35,1.4,null,null,0,null,null,0,0,0,0,0]
[60,null,null,"B",{"$f":"VLOOKUP(F61,'Groep A'!X$2:Y78,2)","v":0.95},26,1.04,null,null,0,null,null,0,0,0,0,0]
[61,null,null,"B",{"$f":"VLOOKUP(F62,'Groep A'!X$2:Y79,2)","v":0.85},25,1,null,null,0,null,null,0,0,0,0,0]
[62,null,null,"B",{"$f":"VLOOKUP(F63,'Groep A'!X$2:Y81,2)","v":0.85},25,1,null,null,0,null,null,0,0,0,0,0]
[63,null,null,"B",{"$f":"VLOOKUP(F64,'Groep A'!X$2:Y82,2)","v":0.55000000000000004},20,0.8,null,null,0,null,null,0,0,0,0,0]
[64,null,null,"B",{"$f":"VLOOKUP(F65,'Groep A'!X$2:Y83,2)","v":1.55},40,1.6,null,null,0,null,null,0,0,0,0,0]
[65,null,null,"B",{"$f":"VLOOKUP(F66,'Groep A'!X$2:Y84,2)","v":1.05},28,{"$f":"F66/25","v":1.1200000000000001},null,null,{"$f":"H66/F66*100","v":0},null,null,{"$f":"K66/F66*100","v":0},{"$f":"H66+K66","v":0},{"$f":"N66/50","v":0},{"$f":"O66/G66*100","v":0},{"$f":"ROUNDDOWN(P66,0)","v":0}]
[66,null,null,"B",{"$f":"VLOOKUP(F67,'Groep A'!X$2:Y85,2)","v":0.65},22,0.88,null,null,0,null,null,0,0,0,0,0]
[67,null,null,"B",{"$f":"VLOOKUP(F68,'Groep A'!X$2:Y86,2)","v":1.1499999999999999},30,1.2,null,null,0,null,null,0,0,0,0,0]
[68,null,null,"B",{"$f":"VLOOKUP(F69,'Groep A'!X$2:Y87,2)","v":1.1499999999999999},30,1.2,null,null,0,null,null,0,0,0,0,0]
[69,null,null,"B",{"$f":"VLOOKUP(F70,'Groep A'!X$2:Y93,2)","v":0.27},12,0.48,null,null,0,null,null,0,0,0,0,0]
[70,null,null,"B",{"$f":"VLOOKUP(F71,'Groep A'!X$2:Y94,2)","v":0.27},12,0.48,null,null,0,null,null,0,0,0,0,0]
[71,null,null,"B",{"$f":"VLOOKUP(F72,'Groep A'!X$2:Y95,2)","v":0.27},12,0.48,null,null,0,null,null,0,0,0,0,0]
[72,null,null,"B",{"$f":"VLOOKUP(F73,'Groep A'!X$2:Y96,2)","v":0.27},12,0.48,null,null,0,null,null,0,0,0,0,0]
[73,null,null,"B",{"$f":"VLOOKUP(F74,'Groep A'!X$2:Y97,2)","v":0.27},12,0.48,null,null,0,null,null,0,0,0,0,0]
[74,null,null,"B",{"$f":"VLOOKUP(F75,'Groep A'!X$2:Y99,2)","v":0.27},12,0.48,null,null,0,null,null,0,0,0,0,0]
[75,null,null,"B",{"$f":"VLOOKUP(F76,'Groep A'!X$2:Y100,2)","v":0.27},12,0.48,null,null,0,null,null,0,0,0,0,0]
[76,null,null,"B",{"$f":"VLOOKUP(F77,'Groep A'!X$2:Y101,2)","v":0.27},12,0.48,null,null,0,null,null,0,0,0,0,0]
[77,null,null,"B",{"$f":"VLOOKUP(F78,'Groep A'!X$2:Y102,2)","v":0.27},12,0.48,null,null,0,null,null,0,0,0,0,0]
[78,null,null,"B",{"$f":"VLOOKUP(F79,'Groep A'!X$2:Y103,2)","v":0.27},12,0.48,null,null,0,null,null,0,0,0,0,0]
[79,null,null,"B",{"$f":"VLOOKUP(F80,'Groep A'!X$2:Y104,2)","v":0.27},12,0.48,null,null,0,null,null,0,0,0,0,0]
{"$rows_left_out":11}
{"sheet":"Blad1","index":2,"n_rows":0,"n_cols":0,"rows_kept":0,"cut":false,"hidden":false,"merged":[]}