{"text_format":"1","workbook":"xlsx","n_sheets":3,"sheets":["Groep A","Groep B","Blad1"],"not_rendered":{"charts":0,"images":0,"macros":1,"external_links":0,"defined_names":1,"comments":0,"pivot_tables":0},"unopened":[],"bounds":{"document_bytes":16777216,"sheet_cells":100000,"rows_first":2000,"rows_last":500,"rows_between":2000,"halvings":0,"cell_chars":16384,"cell_head_chars":4096},"cells_cut":0,"cells_raw":0,"read":"whole","date_system":"1900"}

{"sheet":"Groep A","index":0,"n_rows":251,"n_cols":25,"rows_kept":251,"cut":false,"hidden":false,"merged":[]}
[null,"Datum","GROEP A",null,"Moyenne","te maken caramboles","rating getal","caramboles 1e partij","hoogste serie 1e partij","percentage 1e partij","caramboles 2e partij","hoogste serie 2e partij","percentage 2e partij","totaal caramboles","gespeeld gemiddelde","gespeeld percentage","Punten afgerond ","uitgenodigd Finale"]
[1,null,"Adriaan Brinkema","A",{"$f":"VLOOKUP(F2,X$2:Y29,2)","v":0.48399999999999999},14,{"$f":"F2/30","v":0.46666666666666667},null,null,{"$f":"H2/F2*100","v":0},null,null,{"$f":"K2/F2*100","v":0},{"$f":"H2+K2","v":0},{"$f":"N2/60","v":0},{"$f":"O2/G2*100","v":0},{"$f":"ROUNDDOWN(P2,0)","v":0},null,null,null,null,null,null,8,0.27500000000000002]
[2,null,"Alea Ali","A",{"$f":"VLOOKUP(F3,X$2:Y30,2)","v":0.65},19,{"$f":"F3/30","v":0.6333333333333333},null,null,{"$f":"H3/F3*100","v":0},null,null,{"$f":"K3/F3*100","v":0},{"$f":"H3+K3","v":0},{"$f":"N3/60","v":0},{"$f":"O3/G3*100","v":0},{"$f":"ROUNDDOWN(P3,0)","v":0},null,null,null,null,null,null,9,0.317]
[3,null,"Andries Meindertsma","A",{"$f":"VLOOKUP(F4,X$2:Y31,2)","v":0.51700000000000002},15,{"$f":"F4/30","v":0.5},null,null,{"$f":"H4/F4*100","v":0},null,null,{"$f":"K4/F4*100","v":0},{"$f":"H4+K4","v":0},{"$f":"N4/60","v":0},{"$f":"O4/G4*100","v":0},{"$f":"ROUNDDOWN(P4,0)","v":0},null,null,null,null,null,null,10,0.35]
[4,null,"Anton Drenth   ","A",{"$f":"VLOOKUP(F5,X$2:Y32,2)","v":0.48399999999999999},14,{"$f":"F5/30","v":0.46666666666666667},null,null,{"$f":"H5/F5*100","v":0},null,null,{"$f":"K5/F5*100","v":0},{"$f":"H5+K5","v":0},{"$f":"N5/60","v":0},{"$f":"O5/G5*100","v":0},{"$f":"ROUNDDOWN(P5,0)","v":0},null,null,null,null,null,null,11,0.38400000000000001]
[5,null,"Arie de Jong","A",{"$f":"VLOOKUP(F6,X$2:Y33,2)","v":0.65},19,{"$f":"F6/30","v":0.6333333333333333},null,null,{"$f":"H6/F6*100","v":0},null,null,{"$f":"K6/F6*100","v":0},{"$f":"H6+K6","v":0},{"$f":"N6/60","v":0},{"$f":"O6/G6*100","v":0},{"$f":"ROUNDDOWN(P6,0)","v":0},null,null,null,null,null,null,12,0.41699999999999998]
[6,null,"Arli Sanwikrama","A",{"$f":"VLOOKUP(F7,X$2:Y34,2)","v":0.58399999999999996},17,{"$f":"F7/30","v":0.56666666666666665},null,null,{"$f":"H7/F7*100","v":0},null,null,{"$f":"K7/F7*100","v":0},{"$f":"H7+K7","v":0},{"$f":"N7/60","v":0},{"$f":"O7/G7*100","v":0},{"$f":"ROUNDDOWN(P7,0)","v":0},null,null,null,null,null,null,13,0.45]
[7,null,"Ben Schollink","A",{"$f":"VLOOKUP(F8,X$2:Y35,2)","v":0.71699999999999997},21,{"$f":"F8/30","v":0.7},null,null,{"$f":"H8/F8*100","v":0},null,null,{"$f":"K8/F8*100","v":0},{"$f":"H8+K8","v":0},{"$f":"N8/60","v":0},{"$f":"O8/G8*100","v":0},{"$f":"ROUNDDOWN(P8,0)","v":0},null,null,null,null,null,null,14,0.48399999999999999]
[8,null,"Bert de Jonge","A",{"$f":"VLOOKUP(F9,X$2:Y36,2)","v":0.48399999999999999},14,{"$f":"F9/30","v":0.46666666666666667},null,null,{"$f":"H9/F9*100","v":0},null,null,{"$f":"K9/F9*100","v":0},{"$f":"H9+K9","v":0},{"$f":"N9/60","v":0},{"$f":"O9/G9*100","v":0},{"$f":"ROUNDDOWN(P9,0)","v":0},null,null,null,null,null,null,15,0.51700000000000002]
[9,null,"Bert Mein","A",{"$f":"VLOOKUP(F10,X$2:Y37,2)","v":0.55000000000000004},16,{"$f":"F10/30","v":0.53333333333333333},null,null,{"$f":"H10/F10*100","v":0},null,null,{"$f":"K10/F10*100","v":0},{"$f":"H10+K10","v":0},{"$f":"N10/60","v":0},{"$f":"O10/G10*100","v":0},{"$f":"ROUNDDOWN(P10,0)","v":0},null,null,null,null,null,null,16,0.55000000000000004]
[10,null,"Boele Boelens","A",{"$f":"VLOOKUP(F11,X$2:Y38,2)","v":0.68400000000000005},20,{"$f":"F11/30","v":0.66666666666666663},null,null,{"$f":"H11/F11*100","v":0},null,null,{"$f":"K11/F11*100","v":0},{"$f":"H11+K11","v":0},{"$f":"N11/60","v":0},{"$f":"O11/G11*100","v":0},{"$f":"ROUNDDOWN(P11,0)","v":0},null,null,null,null,null,null,17,0.58399999999999996]
[11,null,"Bram Werkman","A",{"$f":"VLOOKUP(F12,X$2:Y39,2)","v":0.48399999999999999},14,{"$f":"F12/30","v":0.46666666666666667},null,null,{"$f":"H12/F12*100","v":0},null,null,{"$f":"K12/F12*100","v":0},{"$f":"H12+K12","v":0},{"$f":"N12/60","v":0},{"$f":"O12/G12*100","v":0},{"$f":"ROUNDDOWN(P12,0)","v":0},null,null,null,null,null,null,18,0.61699999999999999]
[12,null,"Cris Mulder","A",{"$f":"VLOOKUP(F13,X$2:Y40,2)","v":0.51700000000000002},15,{"$f":"F13/30","v":0.5},null,null,{"$f":"H13/F13*100","v":0},null,null,{"$f":"K13/F13*100","v":0},{"$f":"H13+K13","v":0},{"$f":"N13/60","v":0},{"$f":"O13/G13*100","v":0},{"$f":"ROUNDDOWN(P13,0)","v":0},null,null,null,null,null,null,19,0.65]
[13,null,"Danny Blaauw","A",{"$f":"VLOOKUP(F14,X$2:Y41,2)","v":0.95},28,{"$f":"F14/30","v":0.93333333333333335},null,null,{"$f":"H14/F14*100","v":0},null,null,{"$f":"K14/F14*100","v":0},{"$f":"H14+K14","v":0},{"$f":"N14/60","v":0},{"$f":"O14/G14*100","v":0},{"$f":"ROUNDDOWN(P14,0)","v":0},null,null,null,null,null,null,20,0.68400000000000005]
[14,null,"Derk Boltjes","A",{"$f":"VLOOKUP(F15,X$2:Y42,2)","v":0.55000000000000004},16,{"$f":"F15/30","v":0.53333333333333333},null,null,{"$f":"H15/F15*100","v":0},null,null,{"$f":"K15/F15*100","v":0},{"$f":"H15+K15","v":0},{"$f":"N15/60","v":0},{"$f":"O15/G15*100","v":0},{"$f":"ROUNDDOWN(P15,0)","v":0},null,null,null,null,null,null,21,0.71699999999999997]
[15,null,"Derk Jan v. d. Laan","A",{"$f":"VLOOKUP(F16,X$2:Y43,2)","v":0.45},13,{"$f":"F16/30","v":0.43333333333333335},null,null,{"$f":"H16/F16*100","v":0},null,null,{"$f":"K16/F16*100","v":0},{"$f":"H16+K16","v":0},{"$f":"N16/60","v":0},{"$f":"O16/G16*100","v":0},{"$f":"ROUNDDOWN(P16,0)","v":0},null,null,null,null,null,null,22,0.75]
[16,null,"Douwe Engels","A",{"$f":"VLOOKUP(F17,X$2:Y44,2)","v":0.45},13,{"$f":"F17/30","v":0.43333333333333335},null,null,{"$f":"H17/F17*100","v":0},null,null,{"$f":"K17/F17*100","v":0},{"$f":"H17+K17","v":0},{"$f":"N17/60","v":0},{"$f":"O17/G17*100","v":0},{"$f":"ROUNDDOWN(P17,0)","v":0},null,null,null,null,null,null,23,0.78400000000000003]
[17,null,"Ebel Duursma","A",{"$f":"VLOOKUP(F18,X$2:Y45,2)","v":0.45},13,{"$f":"F18/30","v":0.43333333333333335},null,null,{"$f":"H18/F18*100","v":0},null,null,{"$f":"K18/F18*100","v":0},{"$f":"H18+K18","v":0},{"$f":"N18/60","v":0},{"$f":"O18/G18*100","v":0},{"$f":"ROUNDDOWN(P18,0)","v":0},null,null,null,null,null,null,24,0.81699999999999995]
[18,null,"Eddie Siemens","A",{"$f":"VLOOKUP(F19,X$2:Y46,2)","v":1.1839999999999999},36,{"$f":"F19/30","v":1.2},null,null,{"$f":"H19/F19*100","v":0},null,null,{"$f":"K19/F19*100","v":0},{"$f":"H19+K19","v":0},{"$f":"N19/60","v":0},{"$f":"O19/G19*100","v":0},{"$f":"ROUNDDOWN(P19,0)","v":0},null,null,null,null,null,null,25,0.85]
[19,null,"Eppo Loer   ","A",{"$f":"VLOOKUP(F20,X$2:Y47,2)","v":0.45},13,{"$f":"F20/30","v":0.43333333333333335},null,null,{"$f":"H20/F20*100","v":0},null,null,{"$f":"K20/F20*100","v":0},{"$f":"H20+K20","v":0},{"$f":"N20/60","v":0},{"$f":"O20/G20*100","v":0},{"$f":"ROUNDDOWN(P20,0)","v":0},null,null,null,null,null,null,26,0.88400000000000001]
[20,null,"Erik Kroeze","A",{"$f":"VLOOKUP(F21,X$2:Y48,2)","v":0.55000000000000004},16,{"$f":"F21/30","v":0.53333333333333333},null,null,{"$f":"H21/F21*100","v":0},null,null,{"$f":"K21/F21*100","v":0},{"$f":"H21+K21","v":0},{"$f":"N21/60","v":0},{"$f":"O21/G21*100","v":0},{"$f":"ROUNDDOWN(P21,0)","v":0},null,null,null,null,null,null,27,0.91700000000000004]
[21,null,"Erwin de Groot","A",{"$f":"VLOOKUP(F22,X$2:Y49,2)","v":0.98399999999999999},29,{"$f":"F22/30","v":0.96666666666666667},null,null,{"$f":"H22/F22*100","v":0},null,null,{"$f":"K22/F22*100","v":0},{"$f":"H22+K22","v":0},{"$f":"N22/60","v":0},{"$f":"O22/G22*100","v":0},{"$f":"ROUNDDOWN(P22,0)","v":0},null,null,null,null,null,null,28,0.95]
[22,null,"Fokko van Biessum","A",{"$f":"VLOOKUP(F23,X$2:Y50,2)","v":0.68400000000000005},20,{"$f":"F23/30","v":0.66666666666666663},null,null,{"$f":"H23/F23*100","v":0},null,null,{"$f":"K23/F23*100","v":0},{"$f":"H23+K23","v":0},{"$f":"N23/60","v":0},{"$f":"O23/G23*100","v":0},{"$f":"ROUNDDOWN(P23,0)","v":0},null,null,null,null,null,null,29,0.98399999999999999]
[23,null,"Fré Ketelaar   ","A",{"$f":"VLOOKUP(F24,X$2:Y51,2)","v":0.55000000000000004},16,{"$f":"F24/30","v":0.53333333333333333},null,null,{"$f":"H24/F24*100","v":0},null,null,{"$f":"K24/F24*100","v":0},{"$f":"H24+K24","v":0},{"$f":"N24/60","v":0},{"$f":"O24/G24*100","v":0},{"$f":"ROUNDDOWN(P24,0)","v":0},null,null,null,null,null,null,30,1.0169999999999999]
[24,null,"Gean Klomp","A",{"$f":"VLOOKUP(F25,X$2:Y52,2)","v":0.48399999999999999},14,{"$f":"F25/30","v":0.46666666666666667},null,null,{"$f":"H25/F25*100","v":0},null,null,{"$f":"K25/F25*100","v":0},{"$f":"H25+K25","v":0},{"$f":"N25/60","v":0},{"$f":"O25/G25*100","v":0},{"$f":"ROUNDDOWN(P25,0)","v":0},null,null,null,null,null,null,31,1.05]
[25,null,"Geert Grevink","A",{"$f":"VLOOKUP(F26,X$2:Y53,2)","v":0.65},19,{"$f":"F26/30","v":0.6333333333333333},null,null,{"$f":"H26/F26*100","v":0},null,null,{"$f":"K26/F26*100","v":0},{"$f":"H26+K26","v":0},{"$f":"N26/60","v":0},{"$f":"O26/G26*100","v":0},{"$f":"ROUNDDOWN(P26,0)","v":0},null,null,null,null,null,null,32,1.0840000000000001]
[26,null,"Geert Rijks   ","A",{"$f":"VLOOKUP(F27,X$2:Y54,2)","v":0.51700000000000002},15,{"$f":"F27/30","v":0.5},null,null,{"$f":"H27/F27*100","v":0},null,null,{"$f":"K27/F27*100","v":0},{"$f":"H27+K27","v":0},{"$f":"N27/60","v":0},{"$f":"O27/G27*100","v":0},{"$f":"ROUNDDOWN(P27,0)","v":0},null,null,null,null,null,null,33,1.117]
[27,null,"Geiko Reder","A",{"$f":"VLOOKUP(F28,X$2:Y55,2)","v":0.48399999999999999},14,{"$f":"F28/30","v":0.46666666666666667},null,null,{"$f":"H28/F28*100","v":0},null,null,{"$f":"K28/F28*100","v":0},{"$f":"H28+K28","v":0},{"$f":"N28/60","v":0},{"$f":"O28/G28*100","v":0},{"$f":"ROUNDDOWN(P28,0)","v":0},null,null,null,null,null,null,34,1.1499999999999999]
[28,null,"Gert van Oosten","A",{"$f":"VLOOKUP(F29,X$2:Y56,2)","v":0.51700000000000002},15,{"$f":"F29/30","v":0.5},null,null,{"$f":"H29/F29*100","v":0},null,null,{"$f":"K29/F29*100","v":0},{"$f":"H29+K29","v":0},{"$f":"N29/60","v":0},{"$f":"O29/G29*100","v":0},{"$f":"ROUNDDOWN(P29,0)","v":0},null,null,null,null,null,null,35,1.1839999999999999]
[29,null,"Han Felkers   ","A",{"$f":"VLOOKUP(F30,X$2:Y57,2)","v":0.48399999999999999},14,{"$f":"F30/30","v":0.46666666666666667},null,null,{"$f":"H30/F30*100","v":0},null,null,{"$f":"K30/F30*100","v":0},{"$f":"H30+K30","v":0},{"$f":"N30/60","v":0},{"$f":"O30/G30*100","v":0},{"$f":"ROUNDDOWN(P30,0)","v":0}]
{"$rows_left_out":222}
{"sheet":"Groep B","index":1,"n_rows":400,"n_cols":18,"rows_kept":400,"cut":false,"hidden":false,"merged":[]}
[null,"Datum","GROEP B",null,"Moyenne","te maken caramboles","rating getal","caramboles 1e partij","hoogste serie 1e partij","percentage 1e partij","caramboles 2e partij","hoogste serie 2e partij","percentage 2e partij","totaal caramboles","gespeeld gemiddelde","gespeeld percentage","Punten afgerond ","uitgenodigd Finale"]
[1,null,"Ab Klok","B",{"$f":"VLOOKUP(F2,'Groep A'!X$2:Y124,2)","v":0.27500000000000002},8,{"$f":"F2/30","v":0.26666666666666666},null,null,{"$f":"H2/F2*100","v":0},null,null,{"$f":"K2/F2*100","v":0},{"$f":"H2+K2","v":0},{"$f":"N2/60","v":0},{"$f":"O2/G2*100","v":0},{"$f":"ROUNDDOWN(P2,0)","v":0}]
[2,null,"Abel Brijk","B",{"$f":"VLOOKUP(F3,'Groep A'!X$2:Y120,2)","v":0.35},10,{"$f":"F3/30","v":0.33333333333333331},null,null,{"$f":"H3/F3*100","v":0},null,null,{"$f":"K3/F3*100","v":0},{"$f":"H3+K3","v":0},{"$f":"N3/60","v":0},{"$f":"O3/G3*100","v":0},{"$f":"ROUNDDOWN(P3,0)","v":0}]
[3,null,"Ad Blaauw","B",{"$f":"VLOOKUP(F4,'Groep A'!X$2:Y74,2)","v":0.48399999999999999},14,{"$f":"F4/30","v":0.46666666666666667},null,null,{"$f":"H4/F4*100","v":0},null,null,{"$f":"K4/F4*100","v":0},{"$f":"H4+K4","v":0},{"$f":"N4/60","v":0},{"$f":"O4/G4*100","v":0},{"$f":"ROUNDDOWN(P4,0)","v":0}]
[4,null,"Adam van Dijk","B",{"$f":"VLOOKUP(F5,'Groep A'!X$2:Y128,2)","v":0.27500000000000002},8,{"$f":"F5/30","v":0.26666666666666666},null,null,{"$f":"H5/F5*100","v":0},null,null,{"$f":"K5/F5*100","v":0},{"$f":"H5+K5","v":0},{"$f":"N5/60","v":0},{"$f":"O5/G5*100","v":0},{"$f":"ROUNDDOWN(P5,0)","v":0}]
[5,null,"Adolf Erenstein","B",{"$f":"VLOOKUP(F6,'Groep A'!X$2:Y36,2)","v":0.41699999999999998},12,{"$f":"F6/30","v":0.4},null,null,{"$f":"H6/F6*100","v":0},null,null,{"$f":"K6/F6*100","v":0},{"$f":"H6+K6","v":0},{"$f":"N6/60","v":0},{"$f":"O6/G6*100","v":0},{"$f":"ROUNDDOWN(P6,0)","v":0}]
[6,null,"Albert Dijkema","B",{"$f":"VLOOKUP(F7,'Groep A'!X$2:Y156,2)","v":0.27500000000000002},8,{"$f":"F7/30","v":0.26666666666666666},null,null,{"$f":"H7/F7*100","v":0},null,null,{"$f":"K7/F7*100","v":0},{"$f":"H7+K7","v":0},{"$f":"N7/60","v":0},{"$f":"O7/G7*100","v":0},{"$f":"ROUNDDOWN(P7,0)","v":0}]
[7,null,"Albert Koehoorn","B",{"$f":"VLOOKUP(F8,'Groep A'!X$2:Y98,2)","v":0.35},10,{"$f":"F8/30","v":0.33333333333333331},null,null,{"$f":"H8/F8*100","v":0},null,null,{"$f":"K8/F8*100","v":0},{"$f":"H8+K8","v":0},{"$f":"N8/60","v":0},{"$f":"O8/G8*100","v":0},{"$f":"ROUNDDOWN(P8,0)","v":0}]
[8,null,"Alex Ufkes","B",{"$f":"VLOOKUP(F9,'Groep A'!X$2:Y90,2)","v":0.27500000000000002},8,{"$f":"F9/30","v":0.26666666666666666},null,null,{"$f":"H9/F9*100","v":0},null,null,{"$f":"K9/F9*100","v":0},{"$f":"H9+K9","v":0},{"$f":"N9/60","v":0},{"$f":"O9/G9*100","v":0},{"$f":"ROUNDDOWN(P9,0)","v":0}]
[9,null,"Alex Watermulder   ","B",{"$f":"VLOOKUP(F10,'Groep A'!X$2:Y80,2)","v":0.45},13,{"$f":"F10/30","v":0.43333333333333335},null,null,{"$f":"H10/F10*100","v":0},null,null,{"$f":"K10/F10*100","v":0},{"$f":"H10+K10","v":0},{"$f":"N10/60","v":0},{"$f":"O10/G10*100","v":0},{"$f":"ROUNDDOWN(P10,0)","v":0}]
[10,null,"Alexander Hulshof","B",{"$f":"VLOOKUP(F11,'Groep A'!X$2:Y66,2)","v":0.317},9,{"$f":"F11/30","v":0.3},null,null,{"$f":"H11/F11*100","v":0},null,null,{"$f":"K11/F11*100","v":0},{"$f":"H11+K11","v":0},{"$f":"N11/60","v":0},{"$f":"O11/G11*100","v":0},{"$f":"ROUNDDOWN(P11,0)","v":0}]
[11,null,"Andries Middelbos","B",{"$f":"VLOOKUP(F12,'Groep A'!X$2:Y64,2)","v":0.45},13,{"$f":"F12/30","v":0.43333333333333335},null,null,{"$f":"H12/F12*100","v":0},null,null,{"$f":"K12/F12*100","v":0},{"$f":"H12+K12","v":0},{"$f":"N12/60","v":0},{"$f":"O12/G12*100","v":0},{"$f":"ROUNDDOWN(P12,0)","v":0}]
[12,null,"Andries van de Veen","B",{"$f":"VLOOKUP(F13,'Groep A'!X$2:Y102,2)","v":0.317},9,{"$f":"F13/30","v":0.3},null,null,{"$f":"H13/F13*100","v":0},null,null,{"$f":"K13/F13*100","v":0},{"$f":"H13+K13","v":0},{"$f":"N13/60","v":0},{"$f":"O13/G13*100","v":0},{"$f":"ROUNDDOWN(P13,0)","v":0}]
[13,null,"Anton Drenth   ","B",{"$f":"VLOOKUP(F14,'Groep A'!X$2:Y94,2)","v":0.45},13,{"$f":"F14/30","v":0.43333333333333335},null,null,{"$f":"H14/F14*100","v":0},null,null,{"$f":"K14/F14*100","v":0},{"$f":"H14+K14","v":0},{"$f":"N14/60","v":0},{"$f":"O14/G14*100","v":0},{"$f":"ROUNDDOWN(P14,0)","v":0}]
[14,null,"Arnold Keizer","B",{"$f":"VLOOKUP(F15,'Groep A'!X$2:Y129,2)","v":0.27500000000000002},8,{"$f":"F15/30","v":0.26666666666666666},null,null,{"$f":"H15/F15*100","v":0},null,null,{"$f":"K15/F15*100","v":0},{"$f":"H15+K15","v":0},{"$f":"N15/60","v":0},{"$f":"O15/G15*100","v":0},{"$f":"ROUNDDOWN(P15,0)","v":0}]
[15,null,"Barry Verstegen","B",{"$f":"VLOOKUP(F16,'Groep A'!X$2:Y40,2)","v":0.35},10,{"$f":"F16/30","v":0.33333333333333331},null,null,{"$f":"H16/F16*100","v":0},null,null,{"$f":"K16/F16*100","v":0},{"$f":"H16+K16","v":0},{"$f":"N16/60","v":0},{"$f":"O16/G16*100","v":0},{"$f":"ROUNDDOWN(P16,0)","v":0}]
[16,null,"Bas Mulder","B",{"$f":"VLOOKUP(F17,'Groep A'!X$2:Y85,2)","v":0.38400000000000001},11,{"$f":"F17/30","v":0.36666666666666664},null,null,{"$f":"H17/F17*100","v":0},null,null,{"$f":"K17/F17*100","v":0},{"$f":"H17+K17","v":0},{"$f":"N17/60","v":0},{"$f":"O17/G17*100","v":0},{"$f":"ROUNDDOWN(P17,0)","v":0}]
[17,null,"Bas Viel","B",{"$f":"VLOOKUP(F18,'Groep A'!X$2:Y91,2)","v":0.317},9,{"$f":"F18/30","v":0.3},null,null,{"$f":"H18/F18*100","v":0},null,null,{"$f":"K18/F18*100","v":0},{"$f":"H18+K18","v":0},{"$f":"N18/60","v":0},{"$f":"O18/G18*100","v":0},{"$f":"ROUNDDOWN(P18,0)","v":0}]
[18,null,"Bé van der Laan","B",{"$f":"VLOOKUP(F19,'Groep A'!X$2:Y105,2)","v":0.38400000000000001},11,{"$f":"F19/30","v":0.36666666666666664},null,null,{"$f":"H19/F19*100","v":0},null,null,{"$f":"K19/F19*100","v":0},{"$f":"H19+K19","v":0},{"$f":"N19/60","v":0},{"$f":"O19/G19*100","v":0},{"$f":"ROUNDDOWN(P19,0)","v":0}]
[19,null,"Bé Vrieze","B",{"$f":"VLOOKUP(F20,'Groep A'!X$2:Y74,2)","v":0.317},9,{"$f":"F20/30","v":0.3},null,null,{"$f":"H20/F20*100","v":0},null,null,{"$f":"K20/F20*100","v":0},{"$f":"H20+K20","v":0},{"$f":"N20/60","v":0},{"$f":"O20/G20*100","v":0},{"$f":"ROUNDDOWN(P20,0)","v":0}]
[20,null,"Bennie de Ruiter","B",{"$f":"VLOOKUP(F21,'Groep A'!X$2:Y68,2)","v":0.27500000000000002},8,{"$f":"F21/30","v":0.26666666666666666},null,null,{"$f":"H21/F21*100","v":0},null,null,{"$f":"K21/F21*100","v":0},{"$f":"H21+K21","v":0},{"$f":"N21/60","v":0},{"$f":"O21/G21*100","v":0},{"$f":"ROUNDDOWN(P21,0)","v":0}]
[21,null,"Bernard Besseling","B",{"$f":"VLOOKUP(F22,'Groep A'!X$2:Y106,2)","v":0.27500000000000002},8,{"$f":"F22/30","v":0.26666666666666666},null,null,{"$f":"H22/F22*100","v":0},null,null,{"$f":"K22/F22*100","v":0},{"$f":"H22+K22","v":0},{"$f":"N22/60","v":0},{"$f":"O22/G22*100","v":0},{"$f":"ROUNDDOWN(P22,0)","v":0}]
[22,null,"Bernard Bos   ","B",{"$f":"VLOOKUP(F23,'Groep A'!X$2:Y106,2)","v":0.38400000000000001},11,{"$f":"F23/30","v":0.36666666666666664},null,null,{"$f":"H23/F23*100","v":0},null,null,{"$f":"K23/F23*100","v":0},{"$f":"H23+K23","v":0},{"$f":"N23/60","v":0},{"$f":"O23/G23*100","v":0},{"$f":"ROUNDDOWN(P23,0)","v":0}]
[23,null,"Bernard Wesseling","B",{"$f":"VLOOKUP(F24,'Groep A'!X$2:Y78,2)","v":0.27500000000000002},8,{"$f":"F24/30","v":0.26666666666666666},null,null,{"$f":"H24/F24*100","v":0},null,null,{"$f":"K24/F24*100","v":0},{"$f":"H24+K24","v":0},{"$f":"N24/60","v":0},{"$f":"O24/G24*100","v":0},{"$f":"ROUNDDOWN(P24,0)","v":0}]
[24,null,"Bert Dallinga","B",{"$f":"VLOOKUP(F25,'Groep A'!X$2:Y30,2)","v":0.27500000000000002},8,{"$f":"F25/30","v":0.26666666666666666},null,null,{"$f":"H25/F25*100","v":0},null,null,{"$f":"K25/F25*100","v":0},{"$f":"H25+K25","v":0},{"$f":"N25/60","v":0},{"$f":"O25/G25*100","v":0},{"$f":"ROUNDDOWN(P25,0)","v":0}]
[25,null,"Bert de Jonge","B",{"$f":"VLOOKUP(F26,'Groep A'!X$2:Y43,2)","v":0.45},13,{"$f":"F26/30","v":0.43333333333333335},null,null,{"$f":"H26/F26*100","v":0},null,null,{"$f":"K26/F26*100","v":0},{"$f":"H26+K26","v":0},{"$f":"N26/60","v":0},{"$f":"O26/G26*100","v":0},{"$f":"ROUNDDOWN(P26,0)","v":0}]
[26,null,"Bert Komdeur","B",{"$f":"VLOOKUP(F27,'Groep A'!X$2:Y58,2)","v":0.35},10,{"$f":"F27/30","v":0.33333333333333331},null,null,{"$f":"H27/F27*100","v":0},null,null,{"$f":"K27/F27*100","v":0},{"$f":"H27+K27","v":0},{"$f":"N27/60","v":0},{"$f":"O27/G27*100","v":0},{"$f":"ROUNDDOWN(P27,0)","v":0}]
[27,null,"Bert Olthuis","B",{"$f":"VLOOKUP(F28,'Groep A'!X$2:Y108,2)","v":0.27500000000000002},8,{"$f":"F28/30","v":0.26666666666666666},null,null,{"$f":"H28/F28*100","v":0},null,null,{"$f":"K28/F28*100","v":0},{"$f":"H28+K28","v":0},{"$f":"N28/60","v":0},{"$f":"O28/G28*100","v":0},{"$f":"ROUNDDOWN(P28,0)","v":0}]
[28,null,"Bert Wierenga","B",{"$f":"VLOOKUP(F29,'Groep A'!X$2:Y107,2)","v":0.317},9,{"$f":"F29/30","v":0.3},null,null,{"$f":"H29/F29*100","v":0},null,null,{"$f":"K29/F29*100","v":0},{"$f":"H29+K29","v":0},{"$f":"N29/60","v":0},{"$f":"O29/G29*100","v":0},{"$f":"ROUNDDOWN(P29,0)","v":0}]
[29,null,"Brian Reinert","B",{"$f":"VLOOKUP(F30,'Groep A'!X$2:Y108,2)","v":0.317},9,{"$f":"F30/30","v":0.3},null,null,{"$f":"H30/F30*100","v":0},null,null,{"$f":"K30/F30*100","v":0},{"$f":"H30+K30","v":0},{"$f":"N30/60","v":0},{"$f":"O30/G30*100","v":0},{"$f":"ROUNDDOWN(P30,0)","v":0}]
{"$rows_left_out":371}
{"sheet":"Blad1","index":2,"n_rows":0,"n_cols":0,"rows_kept":0,"cut":false,"hidden":false,"merged":[]}